Форум: Kernels & Drivers
Тема: Проблем с WiFi настройките
Автор: MupKoo

Мнение от MupKoo пуснато на Януари 05 2008, 07:02
Дръпнах си madwifi и като влязох в Ubuntu то вътре няма някакъв инстал файл, а много файлове и въопще нз кое да пусна или как да стане че да успея да си пусна безжичната карта. То я намира и си намира някакви драйвери, но не става WLAN, а HAL
Някой може ли да обесни как става?
Мерси

ПП с 64-битовата версия на Убунту съм и безжичната ми карта е Etheros AS5007EG

ПП2 върнах се на 32-битовата :)



Мнение от cdiem пуснато на Януари 05 2008, 11:06
В Ubuntu 7.10 и 7.04 мисля, че драйверите за Madwifi се намират в Universe хранилището (което трябва да си си пуснал), в пакета linux-restricted-modules-xxxxxxxx (можеш да потърсиш пакета в Synaptic). След като инсталираш драйвера, ако картата още не ти се разпознава, опитай да го заредиш в ядрото: sudo modprobe ath_pci .
Ако държиш ти да си го компилираш и инсталираш, погледни тук:
< https://wiki.ubuntu.com/?action=fullsearch&context=180&value=madwifi&titlesearch=Titles >



Мнение от devik пуснато на Януари 05 2008, 11:29
инсталираш пакетите linux-headers/за твоето ядро/, linux-kbuild и wireless-tools.Копираш архива на мадвифи в /usr/src разархивираш го и се появява папка modules. cd в /usr/src/modules/madwifi.Там пишеш
make
make install
make clean
Ако системата изпищи след make прочети какво липсва и го инсталирай или го постни тука.В /usr/src/modules/madwifi има INSTALL -прочети го има подробно упътване.
Успех

Мнение от hellkiller пуснато на Януари 05 2008, 11:34
Виж < http://madwifi.org/ticket/1679 >. Аз така си подкарах моята.
Мнение от geo1111 пуснато на Януари 05 2008, 14:16
Цитат:  (hellkiller @ Jan. 05 2008,11:34)

Виж < http://madwifi.org/ticket/1679 >. Аз така си подкарах моята.

100 процента става
Мнение от MupKoo пуснато на Януари 05 2008, 16:40
И на мен ми изглежда много добре информацията но нещо не мога да я разкодирам... не мога да се ориентирам какво точно трябва да направя...
Свалих Mad WiFi и ония пач който пишеше и до там....

Requirements ¶

   1) Your linux setup needs to be able to build the madwifi kernel driver from its source and you will need to know how to build kernel drivers. Please refer to the User Documentation webpage at Madwifi.org for more information (madwifi.org/wiki/UserDocs) and the "INSTALL" file in the madwifi driver package.

   2) Please check that your Atheros card has the correct PCI ID of 168C:001C. You should find an entry for Atheros Communications with the PCI ID [168c:001c] using the tool "lspci".

   To get more detailed information about the device, do the following:

    prompt> lspci -d 168c:001c
    02:00.0 Ethernet controller: Atheros Communications, Inc. AR5006EG 802.11
    b/g Wireless PCI Express Adapter (rev 01)

   The last step is to check your machine CPU type.

prompt> uname -i

i386

To apply the patch ¶

   1) Download the madwifi driver 0.9.3.3 package from madwifi.org.

   2) Download the attachment called "madwifi-0933.ar2425.20071130.i386.patch" from this ticket. Attachment viewing is slow due to size of the patch. Use following link to save patch directly on your disk after replacing the <ticket number> with this ticket number.

   http ://madwifi.org/attachment/ticket/<ticket number>/madwifi-0933.ar2425.20071130.i386.patch?format=raw

   3) Extract the madwifi driver and change into the driver directory. Please note that the name of the extracted directory may be different.

prompt> tar -xvzf madwifi-ng-current.tar.gz

madwifi-ng-r2756-20071018/
madwifi-ng-r2756-20071018/THANKS
...

prompt> cd madwifi-ng-r2756-20071018/

   4) Copy your downloaded patch to “madwifi-ng-r2756-20071018” directory and type in following patch command.

prompt> patch -p0 < madwifi-0933.ar2425.20071130.i386.patch

patching file hal/ah.h
patching file hal/public/i386-elf.hal.o.uu
patching file hal/public/i386-elf.inc
patching file hal/public/i386-elf.opt_ah.h
patching file hal/version.h

   5) Make and install this updated driver according the instructions in the "INSTALL" file from the madwifi package.

Някой може ли да ми помогне още малко..

Мнение от hellkiller пуснато на Януари 05 2008, 16:52
Виж < http://news.atwebpages.com/plugins/forum/forum_viewtopic.php?36 >. И по-конкретно втората част от поста (Инсталация чрез madwifi driver). Изтегли отново посочените драйвъри и пач, понеже пачът ставал за определена версия на драйвъра. Успех ;)


Мнение от MupKoo пуснато на Януари 05 2008, 17:10
С риска да изглеждам като пълен идеот ще попитам как става това..

2. Разархивирайте го и влезте в директорията:

prompt> tar -xvzf madwifi-ng-r2756-20071018.tar.gz
prompt> cd madwifi-ng-r2756-20071018/

като вляза в директорията и пускам ТЕРМИНАЛА ли? и там ли почвам да пиша? Пълна мъгла ми е

Мнение от hellkiller пуснато на Януари 05 2008, 18:23
Най-добре сложи двата файла, които си свалил (драйвъра и пача) в една папка. Пускаш конзолата, влизаш в папката и разархивираш и т.н. Успех ;)


Мнение от MupKoo пуснато на Януари 05 2008, 18:58
mupkoo@mupkoo-laptop:~$ tar -xvzf madwifi-ng-r2756-20071018.tar.gz
tar: madwifi-ng-r2756-20071018.tar.gz: Cannot open: No such file or directory
tar: Error is not recoverable: exiting now
tar: Child returned status 2
tar: Error exit delayed from previous errors

Нещо не стана....

Мнение от hellkiller пуснато на Януари 05 2008, 19:02
Не си влязал в папката, където са файловете. Ето пример - папката ти се намира на Desktop-а и се казва New. В нея са двата файла (драйвъра и пача). Отваряш конзолата и пишеш:
1. cd Desktop
2. cd New
3. tar -xvzf madwifi-ng-r2756-20071018.tar.gz
4. т.н. по описаните стъпки

Мнение от MupKoo пуснато на Януари 05 2008, 20:02
mupkoo@mupkoo-laptop:~$ cd desktop
bash: cd: desktop: No such file or directory
mupkoo@mupkoo-laptop:~$ cd /home/mupkoo/desktop
bash: cd: /home/mupkoo/desktop: No such file or directory
Нещо не иска да влиза :( Пробвах и като влязох с Ctrl+Alt+F1 и пак пише същото...

Мнение от hellkiller пуснато на Януари 05 2008, 22:34
Desktop, трябва да е с главна буква. Това има огромно значение ;)
Мнение от MupKoo пуснато на Януари 06 2008, 09:18
Код: 
mupkoo@mupkoo-laptop:~/Desktop/Are/madwifi-ng-r2756-20071018$ make
Checking requirements... ok.
Checking kernel configuration... ok.
make -C /lib/modules/2.6.22-14-generic/build SUBDIRS=/home/mupkoo/Desktop/Are/madwifi-ng-r2756-20071018 modules
make[1]: Entering directory `/usr/src/linux-headers-2.6.22-14-generic'
 CC [M]  /home/mupkoo/Desktop/Are/madwifi-ng-r2756-20071018/ath/if_ath.o
 CC [M]  /home/mupkoo/Desktop/Are/madwifi-ng-r2756-20071018/ath/if_ath_pci.o
 LD [M]  /home/mupkoo/Desktop/Are/madwifi-ng-r2756-20071018/ath/ath_pci.o
 CC [M]  /home/mupkoo/Desktop/Are/madwifi-ng-r2756-20071018/ath_hal/ah_os.o
 HOSTCC  /home/mupkoo/Desktop/Are/madwifi-ng-r2756-20071018/ath_hal/uudecode
/home/mupkoo/Desktop/Are/madwifi-ng-r2756-20071018/ath_hal/uudecode.c:26:19: error: stdio.h: No such file or directory
/home/mupkoo/Desktop/Are/madwifi-ng-r2756-20071018/ath_hal/uudecode.c:27:19: error: errno.h: No such file or directory
/home/mupkoo/Desktop/Are/madwifi-ng-r2756-20071018/ath_hal/uudecode.c:28:20: error: getopt.h: No such file or directory
/home/mupkoo/Desktop/Are/madwifi-ng-r2756-20071018/ath_hal/uudecode.c:29:20: error: string.h: No such file or directory
/home/mupkoo/Desktop/Are/madwifi-ng-r2756-20071018/ath_hal/uudecode.c:30:20: error: stdlib.h: No such file or directory
/home/mupkoo/Desktop/Are/madwifi-ng-r2756-20071018/ath_hal/uudecode.c:32:23: error: sys/fcntl.h: No such file or directory
/home/mupkoo/Desktop/Are/madwifi-ng-r2756-20071018/ath_hal/uudecode.c:33:22: error: sys/stat.h: No such file or directory
/home/mupkoo/Desktop/Are/madwifi-ng-r2756-20071018/ath_hal/uudecode.c: In function 'uudecode_usage':
/home/mupkoo/Desktop/Are/madwifi-ng-r2756-20071018/ath_hal/uudecode.c:37: warning: implicit declaration of function 'printf'
/home/mupkoo/Desktop/Are/madwifi-ng-r2756-20071018/ath_hal/uudecode.c:37: warning: incompatible implicit declaration of built-in function 'printf'
/home/mupkoo/Desktop/Are/madwifi-ng-r2756-20071018/ath_hal/uudecode.c: At top level:
/home/mupkoo/Desktop/Are/madwifi-ng-r2756-20071018/ath_hal/uudecode.c:40: error: expected ')' before '*' token
/home/mupkoo/Desktop/Are/madwifi-ng-r2756-20071018/ath_hal/uudecode.c:70: error: expected ')' before '*' token
/home/mupkoo/Desktop/Are/madwifi-ng-r2756-20071018/ath_hal/uudecode.c: In function 'main':
/home/mupkoo/Desktop/Are/madwifi-ng-r2756-20071018/ath_hal/uudecode.c:121: error: 'FILE' undeclared (first use in this function)
/home/mupkoo/Desktop/Are/madwifi-ng-r2756-20071018/ath_hal/uudecode.c:121: error: (Each undeclared identifier is reported only once
/home/mupkoo/Desktop/Are/madwifi-ng-r2756-20071018/ath_hal/uudecode.c:121: error: for each function it appears in.)
/home/mupkoo/Desktop/Are/madwifi-ng-r2756-20071018/ath_hal/uudecode.c:121: error: 'src_stream' undeclared (first use in this function)
/home/mupkoo/Desktop/Are/madwifi-ng-r2756-20071018/ath_hal/uudecode.c:122: error: 'dst_stream' undeclared (first use in this function)
/home/mupkoo/Desktop/Are/madwifi-ng-r2756-20071018/ath_hal/uudecode.c:122: error: 'NULL' undeclared (first use in this function)
/home/mupkoo/Desktop/Are/madwifi-ng-r2756-20071018/ath_hal/uudecode.c:130: warning: implicit declaration of function 'getopt'
/home/mupkoo/Desktop/Are/madwifi-ng-r2756-20071018/ath_hal/uudecode.c:134: error: 'optarg' undeclared (first use in this function)
/home/mupkoo/Desktop/Are/madwifi-ng-r2756-20071018/ath_hal/uudecode.c:138: warning: implicit declaration of function 'exit'
/home/mupkoo/Desktop/Are/madwifi-ng-r2756-20071018/ath_hal/uudecode.c:138: warning: incompatible implicit declaration of built-in function 'exit'
/home/mupkoo/Desktop/Are/madwifi-ng-r2756-20071018/ath_hal/uudecode.c:141: error: 'optind' undeclared (first use in this function)
/home/mupkoo/Desktop/Are/madwifi-ng-r2756-20071018/ath_hal/uudecode.c:142: error: 'stdin' undeclared (first use in this function)
/home/mupkoo/Desktop/Are/madwifi-ng-r2756-20071018/ath_hal/uudecode.c:144: warning: implicit declaration of function 'fopen'
/home/mupkoo/Desktop/Are/madwifi-ng-r2756-20071018/ath_hal/uudecode.c:146: warning: implicit declaration of function 'fprintf'
/home/mupkoo/Desktop/Are/madwifi-ng-r2756-20071018/ath_hal/uudecode.c:146: warning: incompatible implicit declaration of built-in function 'fprintf'
/home/mupkoo/Desktop/Are/madwifi-ng-r2756-20071018/ath_hal/uudecode.c:146: error: 'stderr' undeclared (first use in this function)
/home/mupkoo/Desktop/Are/madwifi-ng-r2756-20071018/ath_hal/uudecode.c:147: warning: implicit declaration of function 'strerror'
/home/mupkoo/Desktop/Are/madwifi-ng-r2756-20071018/ath_hal/uudecode.c:147: error: 'errno' undeclared (first use in this function)
/home/mupkoo/Desktop/Are/madwifi-ng-r2756-20071018/ath_hal/uudecode.c:147: warning: format '%s' expects type 'char *', but argument 4 has type 'int'
/home/mupkoo/Desktop/Are/madwifi-ng-r2756-20071018/ath_hal/uudecode.c:148: warning: incompatible implicit declaration of built-in function 'exit'
/home/mupkoo/Desktop/Are/madwifi-ng-r2756-20071018/ath_hal/uudecode.c:152: warning: incompatible implicit declaration of built-in function 'exit'
/home/mupkoo/Desktop/Are/madwifi-ng-r2756-20071018/ath_hal/uudecode.c:156: warning: implicit declaration of function 'get_line_from_file'
/home/mupkoo/Desktop/Are/madwifi-ng-r2756-20071018/ath_hal/uudecode.c:156: warning: assignment makes pointer from integer without a cast
/home/mupkoo/Desktop/Are/madwifi-ng-r2756-20071018/ath_hal/uudecode.c:157: warning: implicit declaration of function 'strncmp'
/home/mupkoo/Desktop/Are/madwifi-ng-r2756-20071018/ath_hal/uudecode.c:164: warning: incompatible implicit declaration of built-in function 'fprintf'
/home/mupkoo/Desktop/Are/madwifi-ng-r2756-20071018/ath_hal/uudecode.c:165: warning: incompatible implicit declaration of built-in function 'exit'
/home/mupkoo/Desktop/Are/madwifi-ng-r2756-20071018/ath_hal/uudecode.c:168: warning: implicit declaration of function 'strtoul'
/home/mupkoo/Desktop/Are/madwifi-ng-r2756-20071018/ath_hal/uudecode.c:170: warning: implicit declaration of function 'strchr'
/home/mupkoo/Desktop/Are/madwifi-ng-r2756-20071018/ath_hal/uudecode.c:170: warning: incompatible implicit declaration of built-in function 'strchr'
/home/mupkoo/Desktop/Are/madwifi-ng-r2756-20071018/ath_hal/uudecode.c:172: warning: incompatible implicit declaration of built-in function 'fprintf'
/home/mupkoo/Desktop/Are/madwifi-ng-r2756-20071018/ath_hal/uudecode.c:173: warning: incompatible implicit declaration of built-in function 'exit'
/home/mupkoo/Desktop/Are/madwifi-ng-r2756-20071018/ath_hal/uudecode.c:178: warning: implicit declaration of function 'strcmp'
/home/mupkoo/Desktop/Are/madwifi-ng-r2756-20071018/ath_hal/uudecode.c:179: error: 'stdout' undeclared (first use in this function)
/home/mupkoo/Desktop/Are/madwifi-ng-r2756-20071018/ath_hal/uudecode.c:182: error: 'O_WRONLY' undeclared (first use in this function)
/home/mupkoo/Desktop/Are/madwifi-ng-r2756-20071018/ath_hal/uudecode.c:182: error: 'O_CREAT' undeclared (first use in this function)
/home/mupkoo/Desktop/Are/madwifi-ng-r2756-20071018/ath_hal/uudecode.c:182: error: 'O_TRUNC' undeclared (first use in this function)
/home/mupkoo/Desktop/Are/madwifi-ng-r2756-20071018/ath_hal/uudecode.c:186: error: 'O_EXCL' undeclared (first use in this function)
/home/mupkoo/Desktop/Are/madwifi-ng-r2756-20071018/ath_hal/uudecode.c:188: warning: implicit declaration of function 'open'
/home/mupkoo/Desktop/Are/madwifi-ng-r2756-20071018/ath_hal/uudecode.c:189: error: 'S_IRWXU' undeclared (first use in this function)
/home/mupkoo/Desktop/Are/madwifi-ng-r2756-20071018/ath_hal/uudecode.c:189: error: 'S_IRWXG' undeclared (first use in this function)
/home/mupkoo/Desktop/Are/madwifi-ng-r2756-20071018/ath_hal/uudecode.c:189: error: 'S_IRWXO' undeclared (first use in this function)
/home/mupkoo/Desktop/Are/madwifi-ng-r2756-20071018/ath_hal/uudecode.c:191: warning: implicit declaration of function 'fdopen'
/home/mupkoo/Desktop/Are/madwifi-ng-r2756-20071018/ath_hal/uudecode.c:193: warning: incompatible implicit declaration of built-in function 'fprintf'
/home/mupkoo/Desktop/Are/madwifi-ng-r2756-20071018/ath_hal/uudecode.c:194: warning: format '%s' expects type 'char *', but argument 4 has type 'int'
/home/mupkoo/Desktop/Are/madwifi-ng-r2756-20071018/ath_hal/uudecode.c:195: warning: incompatible implicit declaration of built-in function 'exit'
/home/mupkoo/Desktop/Are/madwifi-ng-r2756-20071018/ath_hal/uudecode.c:199: warning: implicit declaration of function 'read_stduu'
/home/mupkoo/Desktop/Are/madwifi-ng-r2756-20071018/ath_hal/uudecode.c:201: warning: implicit declaration of function 'fclose'
make[3]: *** [/home/mupkoo/Desktop/Are/madwifi-ng-r2756-20071018/ath_hal/uudecode] Error 1
make[2]: *** [/home/mupkoo/Desktop/Are/madwifi-ng-r2756-20071018/ath_hal] Error 2
make[1]: *** [_module_/home/mupkoo/Desktop/Are/madwifi-ng-r2756-20071018] Error 2
make[1]: Leaving directory `/usr/src/linux-headers-2.6.22-14-generic'
make: *** [modules] Error 2
mupkoo@mupkoo-laptop:~/Desktop/Are/madwifi-ng-r2756-20071018$ make install
Checking requirements... ok.
Checking kernel configuration... ok.
make -C /lib/modules/2.6.22-14-generic/build SUBDIRS=/home/mupkoo/Desktop/Are/madwifi-ng-r2756-20071018 modules
make[1]: Entering directory `/usr/src/linux-headers-2.6.22-14-generic'
 HOSTCC  /home/mupkoo/Desktop/Are/madwifi-ng-r2756-20071018/ath_hal/uudecode
/home/mupkoo/Desktop/Are/madwifi-ng-r2756-20071018/ath_hal/uudecode.c:26:19: error: stdio.h: No such file or directory
/home/mupkoo/Desktop/Are/madwifi-ng-r2756-20071018/ath_hal/uudecode.c:27:19: error: errno.h: No such file or directory
/home/mupkoo/Desktop/Are/madwifi-ng-r2756-20071018/ath_hal/uudecode.c:28:20: error: getopt.h: No such file or directory
/home/mupkoo/Desktop/Are/madwifi-ng-r2756-20071018/ath_hal/uudecode.c:29:20: error: string.h: No such file or directory
/home/mupkoo/Desktop/Are/madwifi-ng-r2756-20071018/ath_hal/uudecode.c:30:20: error: stdlib.h: No such file or directory
/home/mupkoo/Desktop/Are/madwifi-ng-r2756-20071018/ath_hal/uudecode.c:32:23: error: sys/fcntl.h: No such file or directory
/home/mupkoo/Desktop/Are/madwifi-ng-r2756-20071018/ath_hal/uudecode.c:33:22: error: sys/stat.h: No such file or directory
/home/mupkoo/Desktop/Are/madwifi-ng-r2756-20071018/ath_hal/uudecode.c: In function 'uudecode_usage':
/home/mupkoo/Desktop/Are/madwifi-ng-r2756-20071018/ath_hal/uudecode.c:37: warning: implicit declaration of function 'printf'
/home/mupkoo/Desktop/Are/madwifi-ng-r2756-20071018/ath_hal/uudecode.c:37: warning: incompatible implicit declaration of built-in function 'printf'
/home/mupkoo/Desktop/Are/madwifi-ng-r2756-20071018/ath_hal/uudecode.c: At top level:
/home/mupkoo/Desktop/Are/madwifi-ng-r2756-20071018/ath_hal/uudecode.c:40: error: expected ')' before '*' token
/home/mupkoo/Desktop/Are/madwifi-ng-r2756-20071018/ath_hal/uudecode.c:70: error: expected ')' before '*' token
/home/mupkoo/Desktop/Are/madwifi-ng-r2756-20071018/ath_hal/uudecode.c: In function 'main':
/home/mupkoo/Desktop/Are/madwifi-ng-r2756-20071018/ath_hal/uudecode.c:121: error: 'FILE' undeclared (first use in this function)
/home/mupkoo/Desktop/Are/madwifi-ng-r2756-20071018/ath_hal/uudecode.c:121: error: (Each undeclared identifier is reported only once
/home/mupkoo/Desktop/Are/madwifi-ng-r2756-20071018/ath_hal/uudecode.c:121: error: for each function it appears in.)
/home/mupkoo/Desktop/Are/madwifi-ng-r2756-20071018/ath_hal/uudecode.c:121: error: 'src_stream' undeclared (first use in this function)
/home/mupkoo/Desktop/Are/madwifi-ng-r2756-20071018/ath_hal/uudecode.c:122: error: 'dst_stream' undeclared (first use in this function)
/home/mupkoo/Desktop/Are/madwifi-ng-r2756-20071018/ath_hal/uudecode.c:122: error: 'NULL' undeclared (first use in this function)
/home/mupkoo/Desktop/Are/madwifi-ng-r2756-20071018/ath_hal/uudecode.c:130: warning: implicit declaration of function 'getopt'
/home/mupkoo/Desktop/Are/madwifi-ng-r2756-20071018/ath_hal/uudecode.c:134: error: 'optarg' undeclared (first use in this function)
/home/mupkoo/Desktop/Are/madwifi-ng-r2756-20071018/ath_hal/uudecode.c:138: warning: implicit declaration of function 'exit'
/home/mupkoo/Desktop/Are/madwifi-ng-r2756-20071018/ath_hal/uudecode.c:138: warning: incompatible implicit declaration of built-in function 'exit'
/home/mupkoo/Desktop/Are/madwifi-ng-r2756-20071018/ath_hal/uudecode.c:141: error: 'optind' undeclared (first use in this function)
/home/mupkoo/Desktop/Are/madwifi-ng-r2756-20071018/ath_hal/uudecode.c:142: error: 'stdin' undeclared (first use in this function)
/home/mupkoo/Desktop/Are/madwifi-ng-r2756-20071018/ath_hal/uudecode.c:144: warning: implicit declaration of function 'fopen'
/home/mupkoo/Desktop/Are/madwifi-ng-r2756-20071018/ath_hal/uudecode.c:146: warning: implicit declaration of function 'fprintf'
/home/mupkoo/Desktop/Are/madwifi-ng-r2756-20071018/ath_hal/uudecode.c:146: warning: incompatible implicit declaration of built-in function 'fprintf'
/home/mupkoo/Desktop/Are/madwifi-ng-r2756-20071018/ath_hal/uudecode.c:146: error: 'stderr' undeclared (first use in this function)
/home/mupkoo/Desktop/Are/madwifi-ng-r2756-20071018/ath_hal/uudecode.c:147: warning: implicit declaration of function 'strerror'
/home/mupkoo/Desktop/Are/madwifi-ng-r2756-20071018/ath_hal/uudecode.c:147: error: 'errno' undeclared (first use in this function)
/home/mupkoo/Desktop/Are/madwifi-ng-r2756-20071018/ath_hal/uudecode.c:147: warning: format '%s' expects type 'char *', but argument 4 has type 'int'
/home/mupkoo/Desktop/Are/madwifi-ng-r2756-20071018/ath_hal/uudecode.c:148: warning: incompatible implicit declaration of built-in function 'exit'
/home/mupkoo/Desktop/Are/madwifi-ng-r2756-20071018/ath_hal/uudecode.c:152: warning: incompatible implicit declaration of built-in function 'exit'
/home/mupkoo/Desktop/Are/madwifi-ng-r2756-20071018/ath_hal/uudecode.c:156: warning: implicit declaration of function 'get_line_from_file'
/home/mupkoo/Desktop/Are/madwifi-ng-r2756-20071018/ath_hal/uudecode.c:156: warning: assignment makes pointer from integer without a cast
/home/mupkoo/Desktop/Are/madwifi-ng-r2756-20071018/ath_hal/uudecode.c:157: warning: implicit declaration of function 'strncmp'
/home/mupkoo/Desktop/Are/madwifi-ng-r2756-20071018/ath_hal/uudecode.c:164: warning: incompatible implicit declaration of built-in function 'fprintf'
/home/mupkoo/Desktop/Are/madwifi-ng-r2756-20071018/ath_hal/uudecode.c:165: warning: incompatible implicit declaration of built-in function 'exit'
/home/mupkoo/Desktop/Are/madwifi-ng-r2756-20071018/ath_hal/uudecode.c:168: warning: implicit declaration of function 'strtoul'
/home/mupkoo/Desktop/Are/madwifi-ng-r2756-20071018/ath_hal/uudecode.c:170: warning: implicit declaration of function 'strchr'
/home/mupkoo/Desktop/Are/madwifi-ng-r2756-20071018/ath_hal/uudecode.c:170: warning: incompatible implicit declaration of built-in function 'strchr'
/home/mupkoo/Desktop/Are/madwifi-ng-r2756-20071018/ath_hal/uudecode.c:172: warning: incompatible implicit declaration of built-in function 'fprintf'
/home/mupkoo/Desktop/Are/madwifi-ng-r2756-20071018/ath_hal/uudecode.c:173: warning: incompatible implicit declaration of built-in function 'exit'
/home/mupkoo/Desktop/Are/madwifi-ng-r2756-20071018/ath_hal/uudecode.c:178: warning: implicit declaration of function 'strcmp'
/home/mupkoo/Desktop/Are/madwifi-ng-r2756-20071018/ath_hal/uudecode.c:179: error: 'stdout' undeclared (first use in this function)
/home/mupkoo/Desktop/Are/madwifi-ng-r2756-20071018/ath_hal/uudecode.c:182: error: 'O_WRONLY' undeclared (first use in this function)
/home/mupkoo/Desktop/Are/madwifi-ng-r2756-20071018/ath_hal/uudecode.c:182: error: 'O_CREAT' undeclared (first use in this function)
/home/mupkoo/Desktop/Are/madwifi-ng-r2756-20071018/ath_hal/uudecode.c:182: error: 'O_TRUNC' undeclared (first use in this function)
/home/mupkoo/Desktop/Are/madwifi-ng-r2756-20071018/ath_hal/uudecode.c:186: error: 'O_EXCL' undeclared (first use in this function)
/home/mupkoo/Desktop/Are/madwifi-ng-r2756-20071018/ath_hal/uudecode.c:188: warning: implicit declaration of function 'open'
/home/mupkoo/Desktop/Are/madwifi-ng-r2756-20071018/ath_hal/uudecode.c:189: error: 'S_IRWXU' undeclared (first use in this function)
/home/mupkoo/Desktop/Are/madwifi-ng-r2756-20071018/ath_hal/uudecode.c:189: error: 'S_IRWXG' undeclared (first use in this function)
/home/mupkoo/Desktop/Are/madwifi-ng-r2756-20071018/ath_hal/uudecode.c:189: error: 'S_IRWXO' undeclared (first use in this function)
/home/mupkoo/Desktop/Are/madwifi-ng-r2756-20071018/ath_hal/uudecode.c:191: warning: implicit declaration of function 'fdopen'
/home/mupkoo/Desktop/Are/madwifi-ng-r2756-20071018/ath_hal/uudecode.c:193: warning: incompatible implicit declaration of built-in function 'fprintf'
/home/mupkoo/Desktop/Are/madwifi-ng-r2756-20071018/ath_hal/uudecode.c:194: warning: format '%s' expects type 'char *', but argument 4 has type 'int'
/home/mupkoo/Desktop/Are/madwifi-ng-r2756-20071018/ath_hal/uudecode.c:195: warning: incompatible implicit declaration of built-in function 'exit'
/home/mupkoo/Desktop/Are/madwifi-ng-r2756-20071018/ath_hal/uudecode.c:199: warning: implicit declaration of function 'read_stduu'
/home/mupkoo/Desktop/Are/madwifi-ng-r2756-20071018/ath_hal/uudecode.c:201: warning: implicit declaration of function 'fclose'
make[3]: *** [/home/mupkoo/Desktop/Are/madwifi-ng-r2756-20071018/ath_hal/uudecode] Error 1
make[2]: *** [/home/mupkoo/Desktop/Are/madwifi-ng-r2756-20071018/ath_hal] Error 2
make[1]: *** [_module_/home/mupkoo/Desktop/Are/madwifi-ng-r2756-20071018] Error 2
make[1]: Leaving directory `/usr/src/linux-headers-2.6.22-14-generic'
make: *** [modules] Error 2
mupkoo@mupkoo-laptop:~/Desktop/Are/madwifi-ng-r2756-20071018$



нещо  не стана пак... пише все някакви грешки

Иначе до пачването си е добре
Код: 
mupkoo@mupkoo-laptop:~/Desktop/Are/madwifi-ng-r2756-20071018$ patch -p0 < madwifi-ng-0933.ar2425.20071130.i386.patch
patching file hal/ah.h
patching file hal/public/i386-elf.hal.o.uu
patching file hal/public/i386-elf.inc
patching file hal/public/i386-elf.opt_ah.h
patching file hal/version.h



Мнение от nikolavp пуснато на Януари 06 2008, 10:21
Нямаш библиотеките за C доколкото виждам. Потърси го, защото не знам как се казва
Код: 
apt-cache search libc
и после инсталирай някое от тия :). Може би ще ти трябва и пакета libc-dev или нещо подобно ;). Успех!!!

EDIT: При убунту май имаше и
Код: 
apt-get install build-essentials
което ти включва всичко за компилиране ма не съм сигурен дали включва тия библиотеки. Надявам се да съм помогнал



Мнение от devik пуснато на Януари 06 2008, 11:51
За да добавиш модула на madwifi към кернела ти трябва пакета module-assistant,madwifi-source,linux-headers2.6.22-14 и linux-kbuild2.6.22.
Код: 
apt-get install module-assistant linux-headers2.6.22-14 linux-kbuild2.6.22 madwifi source

В /etc/src ще се свали папка madwifi.tar.bz2
След като я разархивираш на същото място влизаш в конзола
Код: 
cd /etc/src/modules/madwifi
make
make install

След рестарт на мрежата би трябвало да имаш работещ wireless

PS Може и по друг начин ако ти е по-лесно
Код: 
# m-a a-i madwifi-source
след като си качил с апт останалите неща.



Мнение от MupKoo пуснато на Януари 06 2008, 14:55
Код: 
mupkoo@mupkoo-laptop:~$ sudo apt-get install linux-headers2.6.22-14
Reading package lists... Done
Building dependency tree      
Reading state information... Done
E: Couldn't find package linux-headers2.6.22-14
mupkoo@mupkoo-laptop:~$ sudo apt-get install madwifi source
Reading package lists... Done
Building dependency tree      
Reading state information... Done
E: Couldn't find package madwifi
mupkoo@mupkoo-laptop:~$ sudo apt-get install linux-kbuild2.6.22
Reading package lists... Done
Building dependency tree      
Reading state information... Done
E: Couldn't find package linux-kbuild2.6.22
mupkoo@mupkoo-laptop:~$


Ами нещо пак не става...само първото се записа....



Мнение от MupKoo пуснато на Януари 06 2008, 16:36
Мерси на всички.. подкарах го безжичния интернет най-накрая :) < https://answers.launchpad.net/ubuntu/+question/21458 > също много помогнаха ако някой има същия проблем може да провери
Мнение от devik пуснато на Януари 06 2008, 16:37
Извинявай
apt-get install linux-headers-2.6.22 /или което там ти е ядрото/ linux-kbuild-2.6.22 пропуснал съм тирето

в madwifi-source ти си изпуснал тирето.
Може би ще ти е по-лесно да ги качиш през synaptic

Мнение от MupKoo пуснато на Януари 06 2008, 17:40
Май май... от там ги качих.. Мерси
Мнение от fear21 пуснато на Февруари 13 2010, 15:19
Мн съм зле, но да попитам все пак, ако някой желае да ми отговори
Код: 
root@bt:~# ls
Wifi
root@bt:~# cd Wifi
root@bt:~/Wifi# ls
madwifi-ng-0933.ar2425.20071130.i386.patch.bz2
madwifi-ng-r2756+ar5007.tar.gz
madwifi-ng-r2756-20071018.tar.gz
root@bt:~/Wifi# tar -xvzf madwifi-ng-r2756-20071018.tar.gz

gzip: stdin: not in gzip format
tar: Child returned status 1
tar: Error exit delayed from previous errors
root@bt:~/Wifi#

То е ясно, че някъде аз бъркам, но зациклям и си нямам на идея къде?
Благодаря предварително!
Мнение от fear21 пуснато на Февруари 13 2010, 16:58
С Atheros AR5007EG Wireless Network Adapter съм. Изтеглих driver от < http://sourceforge.net/projects/madwifi/ >
Направих папка WF на десктопа:
Код: 
root@bt:~/WF# ls
madwifi-0.9.4.tar.gz
root@bt:~/WF# tar xzf madwifi-0.9.4.tar.gz
root@bt:~/WF# ls
madwifi-0.9.4  madwifi-0.9.4.tar.gz
root@bt:~/WF# cd madwifi-0.9.4
root@bt:~/WF/madwifi-0.9.4# make
Checking requirements... ok.
Checking kernel configuration... ok.
make -C /lib/modules/2.6.30.9/build SUBDIRS=/root/WF/madwifi-0.9.4 modules
make[1]: Entering directory `/usr/src/linux-source-2.6.30.9'

 WARNING: Symbol version dump /usr/src/linux-source-2.6.30.9/Module.symvers
          is missing; modules will have no dependencies and modversions.

 CC [M]  /root/WF/madwifi-0.9.4/ath/ib_ath.o
In file included from /root/WF/madwifi-0.9.4/ath/../net80211/ieee80211_monitor.h:45,
                from /root/WF/madwifi-0.9.4/ath/ib_ath.c:71:
/root/WF/madwifi-0.9.4/ath/../ath/ib_athvar.h:98: error: conflicting types for 'irqreturn_t'
include/linux/irqreturn.h:16: error: previous declaration of 'irqreturn_t' was here
/root/WF/madwifi-0.9.4/ath/ib_ath.c: In function 'ath_attach':
/root/WF/madwifi-0.9.4/ath/ib_ath.c:402: error: 'struct net_device' has no member named 'priv'
/root/WF/madwifi-0.9.4/ath/ib_ath.c: In function 'ath_detach':
/root/WF/madwifi-0.9.4/ath/ib_ath.c:958: error: 'struct net_device' has no member named 'priv'
/root/WF/madwifi-0.9.4/ath/ib_ath.c: In function 'ath_vap_create':
/root/WF/madwifi-0.9.4/ath/ib_ath.c:1014: error: 'struct net_device' has no member named 'priv'
/root/WF/madwifi-0.9.4/ath/ib_ath.c:1084: error: 'struct net_device' has no member named 'priv'
/root/WF/madwifi-0.9.4/ath/ib_ath.c: In function 'ath_vap_delete':
/root/WF/madwifi-0.9.4/ath/ib_ath.c:1248: error: 'struct net_device' has no member named 'priv'
/root/WF/madwifi-0.9.4/ath/ib_ath.c: In function 'ath_suspend':
/root/WF/madwifi-0.9.4/ath/ib_ath.c:1350: error: 'struct net_device' has no member named 'priv'
/root/WF/madwifi-0.9.4/ath/ib_ath.c: In function 'ath_resume':
/root/WF/madwifi-0.9.4/ath/ib_ath.c:1359: error: 'struct net_device' has no member named 'priv'
/root/WF/madwifi-0.9.4/ath/ib_ath.c: In function 'ath_intr':
/root/WF/madwifi-0.9.4/ath/ib_ath.c:1652: error: 'struct net_device' has no member named 'priv'
/root/WF/madwifi-0.9.4/ath/ib_ath.c: In function 'ath_bmiss_tasklet':
/root/WF/madwifi-0.9.4/ath/ib_ath.c:1843: error: 'struct net_device' has no member named 'priv'
/root/WF/madwifi-0.9.4/ath/ib_ath.c: In function 'ath_init':
/root/WF/madwifi-0.9.4/ath/ib_ath.c:1886: error: 'struct net_device' has no member named 'priv'
/root/WF/madwifi-0.9.4/ath/ib_ath.c: In function 'ath_stop_locked':
/root/WF/madwifi-0.9.4/ath/ib_ath.c:2014: error: 'struct net_device' has no member named 'priv'
/root/WF/madwifi-0.9.4/ath/ib_ath.c: In function 'ath_stop':
/root/WF/madwifi-0.9.4/ath/ib_ath.c:2078: error: 'struct net_device' has no member named 'priv'
/root/WF/madwifi-0.9.4/ath/ib_ath.c: In function 'ath_reset':
/root/WF/madwifi-0.9.4/ath/ib_ath.c:2182: error: 'struct net_device' has no member named 'priv'
/root/WF/madwifi-0.9.4/ath/ib_ath.c: In function 'ath_tx_startraw':
/root/WF/madwifi-0.9.4/ath/ib_ath.c:2343: error: 'struct net_device' has no member named 'priv'
/root/WF/madwifi-0.9.4/ath/ib_ath.c: In function 'ath_hardstart':
/root/WF/madwifi-0.9.4/ath/ib_ath.c:2558: error: 'struct net_device' has no member named 'priv'
/root/WF/madwifi-0.9.4/ath/ib_ath.c: In function 'ath_mgtstart':
/root/WF/madwifi-0.9.4/ath/ib_ath.c:2875: error: 'struct net_device' has no member named 'priv'
/root/WF/madwifi-0.9.4/ath/ib_ath.c: In function 'ath_key_alloc':
/root/WF/madwifi-0.9.4/ath/ib_ath.c:3237: error: 'struct net_device' has no member named 'priv'
/root/WF/madwifi-0.9.4/ath/ib_ath.c: In function 'ath_key_delete':
/root/WF/madwifi-0.9.4/ath/ib_ath.c:3304: error: 'struct net_device' has no member named 'priv'
/root/WF/madwifi-0.9.4/ath/ib_ath.c: In function 'ath_key_set':
/root/WF/madwifi-0.9.4/ath/ib_ath.c:3380: error: 'struct net_device' has no member named 'priv'
/root/WF/madwifi-0.9.4/ath/ib_ath.c: In function 'ath_key_update_begin':
/root/WF/madwifi-0.9.4/ath/ib_ath.c:3395: error: 'struct net_device' has no member named 'priv'
/root/WF/madwifi-0.9.4/ath/ib_ath.c: In function 'ath_key_update_end':
/root/WF/madwifi-0.9.4/ath/ib_ath.c:3416: error: 'struct net_device' has no member named 'priv'
/root/WF/madwifi-0.9.4/ath/ib_ath.c: In function 'ath_mode_init':
/root/WF/madwifi-0.9.4/ath/ib_ath.c:3504: error: 'struct net_device' has no member named 'priv'
/root/WF/madwifi-0.9.4/ath/ib_ath.c: In function 'ath_updateslot':
/root/WF/madwifi-0.9.4/ath/ib_ath.c:3555: error: 'struct net_device' has no member named 'priv'
/root/WF/madwifi-0.9.4/ath/ib_ath.c: In function 'ath_beacon_dturbo_config':
/root/WF/madwifi-0.9.4/ath/ib_ath.c:3585: error: 'struct net_device' has no member named 'priv'
/root/WF/madwifi-0.9.4/ath/ib_ath.c: In function 'ath_beacon_dturbo_update':
/root/WF/madwifi-0.9.4/ath/ib_ath.c:3633: error: 'struct net_device' has no member named 'priv'
/root/WF/madwifi-0.9.4/ath/ib_ath.c: In function 'ath_turbo_switch_mode':
/root/WF/madwifi-0.9.4/ath/ib_ath.c:3776: error: 'struct net_device' has no member named 'priv'
/root/WF/madwifi-0.9.4/ath/ib_ath.c: In function 'ath_bstuck_tasklet':
/root/WF/madwifi-0.9.4/ath/ib_ath.c:4368: error: 'struct net_device' has no member named 'priv'
/root/WF/madwifi-0.9.4/ath/ib_ath.c: In function 'ath_node_alloc':
/root/WF/madwifi-0.9.4/ath/ib_ath.c:4820: error: 'struct net_device' has no member named 'priv'
/root/WF/madwifi-0.9.4/ath/ib_ath.c: In function 'ath_node_cleanup':
/root/WF/madwifi-0.9.4/ath/ib_ath.c:4855: error: 'struct net_device' has no member named 'priv'
/root/WF/madwifi-0.9.4/ath/ib_ath.c: In function 'ath_node_free':
/root/WF/madwifi-0.9.4/ath/ib_ath.c:4909: error: 'struct net_device' has no member named 'priv'
/root/WF/madwifi-0.9.4/ath/ib_ath.c: In function 'ath_rx_capture':
/root/WF/madwifi-0.9.4/ath/ib_ath.c:5404: error: 'struct net_device' has no member named 'priv'
/root/WF/madwifi-0.9.4/ath/ib_ath.c: In function 'ath_tx_capture':
/root/WF/madwifi-0.9.4/ath/ib_ath.c:5437: error: 'struct net_device' has no member named 'priv'
/root/WF/madwifi-0.9.4/ath/ib_ath.c: In function 'ath_recv_mgmt':
/root/WF/madwifi-0.9.4/ath/ib_ath.c:5502: error: 'struct net_device' has no member named 'priv'
/root/WF/madwifi-0.9.4/ath/ib_ath.c: In function 'ath_rx_tasklet':
/root/WF/madwifi-0.9.4/ath/ib_ath.c:5574: error: 'struct net_device' has no member named 'priv'
/root/WF/madwifi-0.9.4/ath/ib_ath.c: In function 'ath_grppoll_start':
/root/WF/madwifi-0.9.4/ath/ib_ath.c:6013: error: 'struct net_device' has no member named 'priv'
/root/WF/madwifi-0.9.4/ath/ib_ath.c: In function 'ath_grppoll_stop':
/root/WF/madwifi-0.9.4/ath/ib_ath.c:6226: error: 'struct net_device' has no member named 'priv'
/root/WF/madwifi-0.9.4/ath/ib_ath.c: In function 'ath_wme_update':
/root/WF/madwifi-0.9.4/ath/ib_ath.c:6441: error: 'struct net_device' has no member named 'priv'
/root/WF/madwifi-0.9.4/ath/ib_ath.c: In function 'ath_uapsd_flush':
/root/WF/madwifi-0.9.4/ath/ib_ath.c:6460: error: 'struct net_device' has no member named 'priv'
/root/WF/madwifi-0.9.4/ath/ib_ath.c: In function 'ath_tx_start':
/root/WF/madwifi-0.9.4/ath/ib_ath.c:6655: error: 'struct net_device' has no member named 'priv'
/root/WF/madwifi-0.9.4/ath/ib_ath.c: In function 'ath_tx_tasklet_q0':
/root/WF/madwifi-0.9.4/ath/ib_ath.c:7495: error: 'struct net_device' has no member named 'priv'
/root/WF/madwifi-0.9.4/ath/ib_ath.c: In function 'ath_tx_tasklet_q0123':
/root/WF/madwifi-0.9.4/ath/ib_ath.c:7516: error: 'struct net_device' has no member named 'priv'
/root/WF/madwifi-0.9.4/ath/ib_ath.c: In function 'ath_tx_tasklet':
/root/WF/madwifi-0.9.4/ath/ib_ath.c:7551: error: 'struct net_device' has no member named 'priv'
/root/WF/madwifi-0.9.4/ath/ib_ath.c: In function 'ath_tx_timeout':
/root/WF/madwifi-0.9.4/ath/ib_ath.c:7574: error: 'struct net_device' has no member named 'priv'
/root/WF/madwifi-0.9.4/ath/ib_ath.c: In function 'ath_calibrate':
/root/WF/madwifi-0.9.4/ath/ib_ath.c:7937: error: 'struct net_device' has no member named 'priv'
/root/WF/madwifi-0.9.4/ath/ib_ath.c: In function 'ath_scan_start':
/root/WF/madwifi-0.9.4/ath/ib_ath.c:8003: error: 'struct net_device' has no member named 'priv'
/root/WF/madwifi-0.9.4/ath/ib_ath.c: In function 'ath_scan_end':
/root/WF/madwifi-0.9.4/ath/ib_ath.c:8023: error: 'struct net_device' has no member named 'priv'
/root/WF/madwifi-0.9.4/ath/ib_ath.c: In function 'ath_set_channel':
/root/WF/madwifi-0.9.4/ath/ib_ath.c:8041: error: 'struct net_device' has no member named 'priv'
/root/WF/madwifi-0.9.4/ath/ib_ath.c: In function 'ath_set_coverageclass':
/root/WF/madwifi-0.9.4/ath/ib_ath.c:8057: error: 'struct net_device' has no member named 'priv'
/root/WF/madwifi-0.9.4/ath/ib_ath.c: In function 'ath_mhz2ieee':
/root/WF/madwifi-0.9.4/ath/ib_ath.c:8067: error: 'struct net_device' has no member named 'priv'
/root/WF/madwifi-0.9.4/ath/ib_ath.c: In function 'ath_newstate':
/root/WF/madwifi-0.9.4/ath/ib_ath.c:8082: error: 'struct net_device' has no member named 'priv'
/root/WF/madwifi-0.9.4/ath/ib_ath.c: In function 'ath_setup_stationkey':
/root/WF/madwifi-0.9.4/ath/ib_ath.c:8471: error: 'struct net_device' has no member named 'priv'
/root/WF/madwifi-0.9.4/ath/ib_ath.c: In function 'ath_newassoc':
/root/WF/madwifi-0.9.4/ath/ib_ath.c:8631: error: 'struct net_device' has no member named 'priv'
/root/WF/madwifi-0.9.4/ath/ib_ath.c: In function 'ath_getchannels':
/root/WF/madwifi-0.9.4/ath/ib_ath.c:8662: error: 'struct net_device' has no member named 'priv'
/root/WF/madwifi-0.9.4/ath/ib_ath.c: In function 'ath_xr_rate_setup':
/root/WF/madwifi-0.9.4/ath/ib_ath.c:8832: error: 'struct net_device' has no member named 'priv'
/root/WF/madwifi-0.9.4/ath/ib_ath.c: In function 'ath_setup_subrates':
/root/WF/madwifi-0.9.4/ath/ib_ath.c:8861: error: 'struct net_device' has no member named 'priv'
/root/WF/madwifi-0.9.4/ath/ib_ath.c: In function 'ath_rate_setup':
/root/WF/madwifi-0.9.4/ath/ib_ath.c:8904: error: 'struct net_device' has no member named 'priv'
/root/WF/madwifi-0.9.4/ath/ib_ath.c: In function 'ath_getstats':
/root/WF/madwifi-0.9.4/ath/ib_ath.c:9141: error: 'struct net_device' has no member named 'priv'
/root/WF/madwifi-0.9.4/ath/ib_ath.c: In function 'ath_set_mac_address':
/root/WF/madwifi-0.9.4/ath/ib_ath.c:9164: error: 'struct net_device' has no member named 'priv'
/root/WF/madwifi-0.9.4/ath/ib_ath.c: In function 'ath_change_mtu':
/root/WF/madwifi-0.9.4/ath/ib_ath.c:9196: error: 'struct net_device' has no member named 'priv'
/root/WF/madwifi-0.9.4/ath/ib_ath.c: In function 'ath_ioctl':
/root/WF/madwifi-0.9.4/ath/ib_ath.c:9283: error: 'struct net_device' has no member named 'priv'
/root/WF/madwifi-0.9.4/ath/ib_ath.c: In function 'ath_announce':
/root/WF/madwifi-0.9.4/ath/ib_ath.c:9779: error: 'struct net_device' has no member named 'priv'
/root/WF/madwifi-0.9.4/ath/ib_ath.c: In function 'ath_rcv_dev_event':
/root/WF/madwifi-0.9.4/ath/ib_ath.c:9926: error: 'struct net_device' has no member named 'priv'
make[3]: *** [/root/WF/madwifi-0.9.4/ath/ib_ath.o] Error 1
make[2]: *** [/root/WF/madwifi-0.9.4/ath] Error 2
make[1]: *** [_module_/root/WF/madwifi-0.9.4] Error 2
make[1]: Leaving directory `/usr/src/linux-source-2.6.30.9'
make: *** [modules] Error 2
root@bt:~/WF/madwifi-0.9.4# make install
sh scripts/find-madwifi-modules.sh 2.6.30.9
for i in ath/ ath_hal/ ath_rate/ net80211/; do \
               make -C $i install || exit 1; \
       done
make[1]: Entering directory `/root/WF/madwifi-0.9.4/ath'
test -d //lib/modules/2.6.30.9/net || mkdir -p //lib/modules/2.6.30.9/net
install ath_pci.ko //lib/modules/2.6.30.9/net
install: cannot stat `ath_pci.ko': No such file or directory
make[1]: *** [install] Error 1
make[1]: Leaving directory `/root/WF/madwifi-0.9.4/ath'
make: *** [install-modules] Error 1
root@bt:~/WF/madwifi-0.9.4#

Мнение от fear21 пуснато на Февруари 13 2010, 17:13
казаха ми да си пусна картата по този начин, но:
Код: 
root@bt:~# ifconfig eth0 up
root@bt:~# dhclient eth0
Internet Systems Consortium DHCP Client V3.1.1
Copyright 2004-2008 Internet Systems Consortium.
All rights reserved.
For info, please visit http://www.isc.org/sw/dhcp/

Listening on LPF/eth0/00:0c:29:77:f7:da
Sending on   LPF/eth0/00:0c:29:77:f7:da
Sending on   Socket/fallback
DHCPDISCOVER on eth0 to 255.255.255.255 port 67 interval 5
DHCPDISCOVER on eth0 to 255.255.255.255 port 67 interval 13
DHCPDISCOVER on eth0 to 255.255.255.255 port 67 interval 14
DHCPDISCOVER on eth0 to 255.255.255.255 port 67 interval 9
DHCPDISCOVER on eth0 to 255.255.255.255 port 67 interval 20
No DHCPOFFERS received.
No working leases in persistent database - sleeping.

Мнение от vas пуснато на Февруари 13 2010, 23:30
Здравей fear21!
Мисля, че тази карта се поддържа от всички ядра по-нови от 2.6.26. Не пишеш с каква дистрибуция си. Аз имам същата карта. Ползвам Мандрива 2010 и Убунту 9.04 и двете системи разпознаха картата, не съм имал никакви проблеми. Постни изхода от командите ifconfig и iwconfig.
Поздрави
Мнение от fear21 пуснато на Февруари 14 2010, 10:03
Здравей! С BackTrack 4 Final, през VMware
Код: 
root@bt:~# iwconfig
lo        no wireless extensions.

eth0      no wireless extensions.

root@bt:~# ifconfig
eth0      Link encap:Ethernet  HWaddr 00:0c:29:77:f7:da
         UP BROADCAST RUNNING MULTICAST  MTU:1500  Metric:1
         RX packets:49 errors:0 dropped:0 overruns:0 frame:0
         TX packets:5 errors:0 dropped:0 overruns:0 carrier:0
         collisions:0 txqueuelen:1000
         RX bytes:16758 (16.7 KB)  TX bytes:1710 (1.7 KB)
         Interrupt:19 Base address:0x2000

lo        Link encap:Local Loopback
         inet addr:127.0.0.1  Mask:255.0.0.0
         UP LOOPBACK RUNNING  MTU:16436  Metric:1
         RX packets:0 errors:0 dropped:0 overruns:0 frame:0
         TX packets:0 errors:0 dropped:0 overruns:0 carrier:0
         collisions:0 txqueuelen:0
         RX bytes:0 (0.0 B)  TX bytes:0 (0.0 B)

Мнение от vas пуснато на Февруари 14 2010, 22:31
Здравей!
Картата не е разпозната. Прочете ли изписаното в тази тема. Например пост № 16. Може да пробваш да подкараш картата с ndiswraper и драйвера за windows. Ако си начинаещ според мен е по-добре да изпечеш един диск на Mandriva 2010 One и да пробваш. Това е жив диск. Не се инсталира нищо на твърдия диск. Може да пробваш и с жив диск на Ubuntu 9.04 или 9.10.
Поздрави!


Мнение от fear21 пуснато на Февруари 15 2010, 18:18
Благодаря за помощта, четох, мъчих се с ndiswrapper-1.56.tar и xp3264-7.7.0.329-whql за Windows XP, но не става, а иначе ще ина на някоя по-лесна линукс ОС,начинаещ съм, само един въпрос, понеже съм с BENQ Joybook Lite U101, няма DVD/CD за ubuntu видях VMware image, но за Mandriva?Поздрави!
Мнение от vas пуснато на Февруари 17 2010, 20:08
Не съм на ти с виртуалните машини. Ако правилно съм разбрал искаш да разучиш някоя линукс дистрибуция без да я инсталираш на нетбука. Може да пробваш с жива USB Flash памет, ако биоса позволява boot от USB Flash памет. Виж и този български проект може и да ти хареса < http://learnfree.eu/archives/556 >
Мнение от fear21 пуснато на Февруари 19 2010, 15:57
Да, правилно си ме разбрал, благодаря ти за цялата помощ. Поздрави!
Powered by ikonforums 1.0.0 © 2006 ikonforums