»
[ :: ]
 »  » Li Help & Support Applications : wxPython
  • 1 1 Skip to Page:
  • 1
< | >
: : wxPython
#1 Skip to the next post in this topic.
: 28 2005, 23:01
mexus
 

Avatar




: Li fans
: 163
: 2005

:

Offline
wxPython , . . .....
?

:

www:/home/mexus/wxPython-src-2.6.1.0 # ./configure
checking build system type... x86_64-unknown-linux-gnu
checking host system type... x86_64-unknown-linux-gnu
checking target system type... x86_64-unknown-linux-gnu
........
.......
Configured wxWidgets 2.6.1 for `x86_64-unknown-linux-gnu'

 Which GUI toolkit should wxWidgets use?                 x11
 Should wxWidgets be compiled into single library?       no
 Should wxWidgets be compiled in debug mode?             no
 Should wxWidgets be linked as a shared library?         yes
 Should wxWidgets be compiled in Unicode mode?           no
 What level of wxWidgets compatibility should be enabled?
                                      wxWidgets 2.2      no
                                      wxWidgets 2.4      yes
 Which libraries should wxWidgets use?
                                      jpeg               sys
                                      png                sys
                                      regex              sys
                                      tiff               sys
                                      xpm                yes
                                      zlib               sys
                                      odbc               no
                                      expat              sys
                                      libmspack          no
                                      sdl                no
                                      gnomeprint         no
www:/home/mexus/wxPython-src-2.6.1.0 # make
./bk-make-pch .pch/wxprec_coredll/wx/wxprec.h.gch wx/wxprec.h g++ -I.pch/wxprec_coredll -D -D           -DWXUSINGDLL -DWXMAKINGDLL_CORE -DwxUSE_BASE=0 -fPIC -DPIC -DWX_PRECOMP -DNO_GCC_PRAGMA -Ilib/wx/include/x11univ-ansi-release-2.6 -I./include -I/usr/X11R6/include -D_FILE_OFFSET_BITS=64 -D_LARGE_FILES -D_LARGEFILE_SOURCE=1 -O2 -pthread -Wall -Wno-ctor-dtor-privacy
In file included from ./include/wx/event.h:32,
                from ./include/wx/wx.h:23,
                from ./include/wx/wxprec.h:49:
./include/wx/cursor.h:26:31: error: wx/x11/cursor.h: No such file or directory
In file included from ./include/wx/font.h:25,
                from ./include/wx/window.h:28,
                from ./include/wx/app.h:23,
                from ./include/wx/wx.h:24,
                from ./include/wx/wxprec.h:49:
./include/wx/gdiobj.h:24:27: error: wx/x11/gdiobj.h: No such file or directory
In file included from ./include/wx/window.h:28,
                from ./include/wx/app.h:23,
                from ./include/wx/wx.h:24,
                from ./include/wx/wxprec.h:49:
./include/wx/font.h:243:29: error: wx/x11/font.h: No such file or directory
In file included from ./include/wx/window.h:29,
                from ./include/wx/app.h:23,
                from ./include/wx/wx.h:24,
                from ./include/wx/wxprec.h:49:
./include/wx/colour.h:26:27: error: wx/x11/colour.h: No such file or directory
In file included from ./include/wx/window.h:30,
                from ./include/wx/app.h:23,
                from ./include/wx/wx.h:24,
                from ./include/wx/wxprec.h:49:
./include/wx/region.h:24:31: error: wx/x11/region.h: No such file or directory
In file included from ./include/wx/window.h:36,
                from ./include/wx/app.h:23,
                from ./include/wx/wx.h:24,
                from ./include/wx/wxprec.h:49:
./include/wx/palette.h:41:32: error: wx/x11/palette.h: No such file or directory
In file included from ./include/wx/app.h:23,
                from ./include/wx/wx.h:24,
                from ./include/wx/wxprec.h:49:
./include/wx/window.h:1364:31: error: wx/x11/window.h: No such file or directory
In file included from ./include/wx/univ/window.h:21,
                from ./include/wx/window.h:1402,
                from ./include/wx/app.h:23,
                from ./include/wx/wx.h:24,
                from ./include/wx/wxprec.h:49:
./include/wx/bitmap.h:177:27: error: wx/x11/bitmap.h: No such file or directory
In file included from ./include/wx/wx.h:24,
                from ./include/wx/wxprec.h:49:
./include/wx/app.h:572:32: error: wx/x11/app.h: No such file or directory
In file included from ./include/wx/frame.h:23,
                from ./include/wx/wx.h:32,
                from ./include/wx/wxprec.h:49:
./include/wx/toplevel.h:268:33: error: wx/x11/toplevel.h: No such file or directory
In file included from ./include/wx/univ/toplevel.h:20,
                from ./include/wx/toplevel.h:288,
                from ./include/wx/frame.h:23,
                from ./include/wx/wx.h:32,
                from ./include/wx/wxprec.h:49:
./include/wx/icon.h:26:27: error: wx/x11/icon.h: No such file or directory
In file included from ./include/wx/dc.h:29,
                from ./include/wx/wx.h:33,
                from ./include/wx/wxprec.h:49:
./include/wx/brush.h:36:30: error: wx/x11/brush.h: No such file or directory
In file included from ./include/wx/dc.h:30,
                from ./include/wx/wx.h:33,
                from ./include/wx/wxprec.h:49:
./include/wx/pen.h:20:24: error: wx/x11/pen.h: No such file or directory
In file included from ./include/wx/wx.h:33,
                from ./include/wx/wxprec.h:49:
./include/wx/dc.h:814:27: error: wx/x11/dc.h: No such file or directory
In file included from ./include/wx/wx.h:34,
                from ./include/wx/wxprec.h:49:
./include/wx/dcclient.h:24:29: error: wx/x11/dcclient.h: No such file or directory
In file included from ./include/wx/wx.h:35,
                from ./include/wx/wxprec.h:49:
./include/wx/dcmemory.h:24:29: error: wx/x11/dcmemory.h: No such file or directory
In file included from ./include/wx/wx.h:37,
                from ./include/wx/wxprec.h:49:
./include/wx/dcscreen.h:24:29: error: wx/x11/dcscreen.h: No such file or directory
In file included from ./include/wx/combobox.h:25,
                from ./include/wx/univ/choice.h:19,
                from ./include/wx/choice.h:64,
                from ./include/wx/wx.h:56,
                from ./include/wx/wxprec.h:49:
./include/wx/textctrl.h:419:33: error: wx/x11/textctrl.h: No such file or directory
./include/wx/cursor.h: In destructor wxBusyCursorSuspender::~wxBusyCursorSuspender():
./include/wx/cursor.h:70: error: invalid use of undefined type const struct wxCursor
./include/wx/gdicmn.h:36: error: forward declaration of const struct wxCursor
./include/wx/event.h: At global scope:
./include/wx/event.h:933: error: field m_cursor has incomplete type
./include/wx/event.h: In constructor wxSetCursorEvent::wxSetCursorEvent(wxCoord, wxCoord):
./include/wx/event.h:912: error: class wxSetCursorEvent does not have any field named m_cursor
./include/wx/event.h: In copy constructor wxSetCursorEvent::wxSetCursorEvent(const wxSetCursorEvent&):
./include/wx/event.h:919: error: class wxSetCursorEvent does not have any field named m_cursor
./include/wx/event.h:919: error: const class wxSetCursorEvent has no member named m_cursor
./include/wx/event.h: In member function void wxSetCursorEvent::SetCursor(const wxCursor&):
./include/wx/event.h:925: error: m_cursor was not declared in this scope
./include/wx/event.h: In member function const wxCursor& wxSetCursorEvent::GetCursor() const:
./include/wx/event.h:926: error: m_cursor was not declared in this scope
./include/wx/event.h: In member function bool wxSetCursorEvent::HasCursor() const:
./include/wx/event.h:927: error: m_cursor was not declared in this scope
./include/wx/font.h: At global scope:
./include/wx/font.h:116: error: expected class-name before { token
./include/wx/font.h: In member function bool wxFontBase::Ok() const:
./include/wx/font.h:164: error: m_refData was not declared in this scope
./include/wx/font.h: In member function wxFontRefData* wxFontBase::GetFontData() const:
./include/wx/font.h:220: error: m_refData was not declared in this scope
./include/wx/palette.h: At global scope:
./include/wx/palette.h:24: error: expected class-name before { token
./include/wx/window.h:84: error: field font has incomplete type
./include/wx/window.h:87: error: field colFg has incomplete type
./include/wx/window.h:91: error: field colBg has incomplete type
./include/wx/window.h:1140: error: field m_cursor has incomplete type
./include/wx/window.h:1141: error: field m_font has incomplete type
./include/wx/window.h:1142: error: field m_backgroundColour has incomplete type
./include/wx/window.h:1143: error: field m_foregroundColour has incomplete type
./include/wx/window.h:1150: error: field m_updateRegion has incomplete type
./include/wx/window.h:1203: error: field m_palette has incomplete type
./include/wx/window.h: In member function const wxRegion& wxWindowBase::GetUpdateRegion() const:
./include/wx/window.h:709: error: m_updateRegion was not declared in this scope
./include/wx/window.h: In member function wxRegion& wxWindowBase::GetUpdateRegion():
./include/wx/window.h:710: error: m_updateRegion was not declared in this scope
./include/wx/window.h: In member function const wxCursor& wxWindowBase::GetCursor() const:
./include/wx/window.h:794: error: m_cursor was not declared in this scope
./include/wx/window.h: In member function wxPalette wxWindowBase::GetPalette() const:
./include/wx/window.h:1047: error: return type struct wxPalette is incomplete
./include/wx/window.h:1047: error: m_palette was not declared in this scope
./include/wx/bitmap.h: At global scope:
./include/wx/bitmap.h:84: error: expected class-name before { token
./include/wx/bitmap.h: In constructor wxBitmapBase::wxBitmapBase():
./include/wx/bitmap.h:86: error: class wxBitmapBase does not have any field named wxGDIObject
./include/wx/univ/window.h: At global scope:
./include/wx/univ/window.h:53: error: expected class-name before { token
./include/wx/univ/window.h:246: error: field m_bitmapBg has incomplete type
./include/wx/univ/window.h: In constructor wxWindow::wxWindow(wxWindow*, wxWindowID, const wxPoint&, const wxSize&, long int, const wxString&):
./include/wx/univ/window.h:66: error: class wxWindow does not have any field named wxWindowX11
./include/wx/univ/window.h: In member function bool wxWindow::UseFgCol() const:
./include/wx/univ/window.h:153: error: m_hasFgCol was not declared in this scope
./include/wx/univ/window.h: In member function bool wxWindow::UseFont() const:
./include/wx/univ/window.h:154: error: m_hasFont was not declared in this scope
./include/wx/window.h: In member function wxWindow* wxWindowBase::GetGrandParent() const:
./include/wx/window.h:1412: error: class wxWindow has no member named GetParent
./include/wx/app.h: In constructor wxAppInitializer::wxAppInitializer(wxAppConsole* (*)()):
./include/wx/app.h:628: error: wxApp has not been declared
./include/wx/app.h:628: error: SetInitializerFunction was not declared in this scope
./include/wx/toplevel.h: In member function virtual bool wxTopLevelWindowBase::IsActive():
./include/wx/toplevel.h:180: error: FindFocus was not declared in this scope
./include/wx/univ/inpcons.h: At global scope:
./include/wx/univ/inpcons.h:43: warning: class wxInputConsumer has virtual functions but non-virtual destructor
./include/wx/univ/toplevel.h:95: error: expected class-name before , token
./include/wx/univ/toplevel.h:169: error: field m_titlebarIcon has incomplete type
./include/wx/univ/toplevel.h:97: warning: class wxTopLevelWindow has virtual functions but non-virtual destructor
./include/wx/univ/toplevel.h:200: error: field m_origCursor has incomplete type
./include/wx/brush.h:21: error: expected class-name before { token
./include/wx/dc.h:784: error: field m_pen has incomplete type
./include/wx/dc.h:785: error: field m_brush has incomplete type
./include/wx/dc.h:786: error: field m_backgroundBrush has incomplete type
./include/wx/dc.h:787: error: field m_textForegroundColour has incomplete type
./include/wx/dc.h:788: error: field m_textBackgroundColour has incomplete type
./include/wx/dc.h:789: error: field m_font has incomplete type
./include/wx/dc.h:792: error: field m_palette has incomplete type
./include/wx/dc.h: In constructor wxDCBase::wxDCBase():
./include/wx/dc.h:126: error: class wxDCBase does not have any field named m_pen
./include/wx/dc.h:127: error: class wxDCBase does not have any field named m_brush
./include/wx/dc.h:128: error: class wxDCBase does not have any field named m_backgroundBrush
./include/wx/dc.h:129: error: class wxDCBase does not have any field named m_textForegroundColour
./include/wx/dc.h:130: error: class wxDCBase does not have any field named m_textBackgroundColour
./include/wx/dc.h:131: error: class wxDCBase does not have any field named m_font
./include/wx/dc.h:133: error: class wxDCBase does not have any field named m_palette
./include/wx/dc.h: In member function const wxBrush& wxDCBase::GetBackground() const:
./include/wx/dc.h:488: error: m_backgroundBrush was not declared in this scope
./include/wx/dc.h: In member function const wxBrush& wxDCBase::GetBrush() const:
./include/wx/dc.h:489: error: m_brush was not declared in this scope
./include/wx/dc.h: In member function const wxFont& wxDCBase::GetFont() const:
./include/wx/dc.h:490: error: m_font was not declared in this scope
./include/wx/dc.h: In member function const wxPen& wxDCBase::GetPen() const:
./include/wx/dc.h:491: error: m_pen was not declared in this scope
./include/wx/dc.h: In member function const wxColour& wxDCBase::GetTextForeground() const:
./include/wx/dc.h:493: error: m_textForegroundColour was not declared in this scope
./include/wx/dc.h: In member function const wxColour& wxDCBase::GetTextBackground() const:
./include/wx/dc.h:494: error: m_textBackgroundColour was not declared in this scope
./include/wx/dc.h: In member function virtual void wxDCBase::SetTextForeground(const wxColour&):
./include/wx/dc.h:496: error: m_textForegroundColour was not declared in this scope
./include/wx/dc.h: In member function virtual void wxDCBase::SetTextBackground(const wxColour&):
./include/wx/dc.h:498: error: m_textBackgroundColour was not declared in this scope
./include/wx/dc.h: At global scope:
./include/wx/dc.h:851: error: field m_colFgOld has incomplete type
./include/wx/dc.h: In constructor wxDCTextColourChanger::wxDCTextColourChanger(wxDC&):
./include/wx/dc.h:833: error: class wxDCTextColourChanger does not have any field named m_colFgOld
./include/wx/dc.h: In destructor wxDCTextColourChanger::~wxDCTextColourChanger():
./include/wx/dc.h:837: error: m_colFgOld was not declared in this scope
./include/wx/dc.h:838: error: invalid use of undefined type struct wxDC
./include/wx/event.h:46: error: forward declaration of struct wxDC
./include/wx/dc.h: In member function void wxDCTextColourChanger::Set(const wxColour&):
./include/wx/dc.h:843: error: m_colFgOld was not declared in this scope
./include/wx/dc.h:844: error: invalid use of undefined type struct wxDC
./include/wx/event.h:46: error: forward declaration of struct wxDC
./include/wx/dc.h:845: error: invalid use of undefined type struct wxDC
./include/wx/event.h:46: error: forward declaration of struct wxDC
./include/wx/dc.h: In constructor wxDCClipper::wxDCClipper(wxDC&, const wxRect&):
./include/wx/dc.h:865: error: invalid use of undefined type struct wxDC
./include/wx/event.h:46: error: forward declaration of struct wxDC
./include/wx/dc.h: In constructor wxDCClipper::wxDCClipper(wxDC&, wxCoord, wxCoord, wxCoord, wxCoord):
./include/wx/dc.h:867: error: invalid use of undefined type struct wxDC
./include/wx/event.h:46: error: forward declaration of struct wxDC
./include/wx/dc.h: In destructor wxDCClipper::~wxDCClipper():
./include/wx/dc.h:869: error: invalid use of undefined type struct wxDC
./include/wx/event.h:46: error: forward declaration of struct wxDC
./include/wx/control.h: In member function int wxControlBase::GetAlignment() const:
./include/wx/control.h:51: error: m_windowStyle was not declared in this scope
./include/wx/control.h: In member function virtual void wxControlBase::SetInitialBestSize(const wxSize&):
./include/wx/control.h:102: error: SetBestSize was not declared in this scope
./include/wx/univ/button.h: At global scope:
./include/wx/univ/button.h:126: error: field m_bitmap has incomplete type
./include/wx/univ/menuitem.h:99: error: field m_bmpChecked has incomplete type
./include/wx/univ/menuitem.h:100: error: field m_bmpUnchecked has incomplete type
./include/wx/univ/menuitem.h:101: error: field m_bmpDisabled has incomplete type
./include/wx/univ/menuitem.h: In member function const wxBitmap& wxMenuItem::GetBitmap(bool) const:
./include/wx/univ/menuitem.h:49: error: m_bmpChecked was not declared in this scope
./include/wx/univ/menuitem.h:49: error: m_bmpUnchecked was not declared in this scope
./include/wx/univ/menuitem.h: In member function void wxMenuItem::SetDisabledBitmap(const wxBitmap&):
./include/wx/univ/menuitem.h:52: error: m_bmpDisabled was not declared in this scope
./include/wx/univ/menuitem.h: In member function const wxBitmap& wxMenuItem::GetDisabledBitmap() const:
./include/wx/univ/menuitem.h:54: error: m_bmpDisabled was not declared in this scope
./include/wx/menu.h: In member function virtual bool wxMenuBarBase::IsEnabled() const:
./include/wx/menu.h:453: error: IsEnabled is not a member of wxWindow
./include/wx/menu.h: In member function virtual void wxMenuBarBase::SetLabel(const wxString&):
./include/wx/menu.h:477: error: SetLabel is not a member of wxWindow
./include/wx/menu.h: In member function virtual wxString wxMenuBarBase::GetLabel() const:
./include/wx/menu.h:478: error: GetLabel is not a member of wxWindow
./include/wx/cmndata.h: At global scope:
./include/wx/cmndata.h:53: error: field m_dataColour has incomplete type
./include/wx/cmndata.h:54: error: field m_custColours has incomplete type
./include/wx/cmndata.h: In member function void wxColourData::SetColour(const wxColour&):
./include/wx/cmndata.h:42: error: m_dataColour was not declared in this scope
./include/wx/cmndata.h: In member function const wxColour& wxColourData::GetColour() const:
./include/wx/cmndata.h:43: error: m_dataColour was not declared in this scope
./include/wx/cmndata.h: In member function wxColour& wxColourData::GetColour():
./include/wx/cmndata.h:44: error: m_dataColour was not declared in this scope
./include/wx/cmndata.h: At global scope:
./include/wx/cmndata.h:127: error: field m_fontColour has incomplete type
./include/wx/cmndata.h:131: error: field m_initialFont has incomplete type
./include/wx/cmndata.h:132: error: field m_chosenFont has incomplete type
./include/wx/cmndata.h: In copy constructor wxFontData::wxFontData(const wxFontData&):
./include/wx/cmndata.h:69: error: class wxFontData does not have any field named m_fontColour
./include/wx/cmndata.h:69: error: const class wxFontData has no member named m_fontColour
./include/wx/cmndata.h:73: error: class wxFontData does not have any field named m_initialFont
./include/wx/cmndata.h:73: error: const class wxFontData has no member named m_initialFont
./include/wx/cmndata.h:74: error: class wxFontData does not have any field named m_chosenFont
./include/wx/cmndata.h:74: error: const class wxFontData has no member named m_chosenFont
./include/wx/cmndata.h: In member function wxFontData& wxFontData::operator=(const wxFontData&):
./include/wx/cmndata.h:85: error: m_fontColour was not declared in this scope
./include/wx/cmndata.h:85: error: const class wxFontData has no member named m_fontColour
./include/wx/cmndata.h:89: error: m_initialFont was not declared in this scope
./include/wx/cmndata.h:89: error: const class wxFontData has no member named m_initialFont
./include/wx/cmndata.h:90: error: m_chosenFont was not declared in this scope
./include/wx/cmndata.h:90: error: const class wxFontData has no member named m_chosenFont
./include/wx/cmndata.h: In member function void wxFontData::SetColour(const wxColour&):
./include/wx/cmndata.h:101: error: m_fontColour was not declared in this scope
./include/wx/cmndata.h: In member function wxColour& wxFontData::GetColour():
./include/wx/cmndata.h:102: error: m_fontColour was not declared in this scope
./include/wx/cmndata.h: In member function void wxFontData::SetInitialFont(const wxFont&):
./include/wx/cmndata.h:110: error: m_initialFont was not declared in this scope
./include/wx/cmndata.h: In member function wxFont wxFontData::GetInitialFont() const:
./include/wx/cmndata.h:111: error: return type struct wxFont is incomplete
./include/wx/cmndata.h:111: error: m_initialFont was not declared in this scope
./include/wx/cmndata.h: In member function void wxFontData::SetChosenFont(const wxFont&):
./include/wx/cmndata.h:113: error: m_chosenFont was not declared in this scope
./include/wx/cmndata.h: In member function wxFont wxFontData::GetChosenFont() const:
./include/wx/cmndata.h:114: error: return type struct wxFont is incomplete
./include/wx/cmndata.h:114: error: m_chosenFont was not declared in this scope
./include/wx/ctrlsub.h: In member function void wxControlWithItems::SetClientData(void*):
./include/wx/ctrlsub.h:178: error: SetClientData is not a member of wxControl
./include/wx/ctrlsub.h: In member function void* wxControlWithItems::GetClientData() const:
./include/wx/ctrlsub.h:178: error: GetClientData is not a member of wxControl
./include/wx/ctrlsub.h: In member function void wxControlWithItems::SetClientObject(wxClientData*):
./include/wx/ctrlsub.h:178: error: SetClientObject is not a member of wxControl
./include/wx/ctrlsub.h: In member function wxClientData* wxControlWithItems::GetClientObject() const:
./include/wx/ctrlsub.h:178: error: GetClientObject is not a member of wxControl
./include/wx/bmpbuttn.h: At global scope:
./include/wx/bmpbuttn.h:69: error: field m_bmpNormal has incomplete type
./include/wx/bmpbuttn.h:70: error: field m_bmpSelected has incomplete type
./include/wx/bmpbuttn.h:71: error: field m_bmpFocus has incomplete type
./include/wx/bmpbuttn.h:72: error: field m_bmpDisabled has incomplete type
./include/wx/bmpbuttn.h: In constructor wxBitmapButtonBase::wxBitmapButtonBase():
./include/wx/bmpbuttn.h:33: error: class wxBitmapButtonBase does not have any field named m_bmpNormal
./include/wx/bmpbuttn.h:33: error: class wxBitmapButtonBase does not have any field named m_bmpSelected
./include/wx/bmpbuttn.h:33: error: class wxBitmapButtonBase does not have any field named m_bmpFocus
./include/wx/bmpbuttn.h:33: error: class wxBitmapButtonBase does not have any field named m_bmpDisabled
./include/wx/bmpbuttn.h: In member function void wxBitmapButtonBase::SetBitmapLabel(const wxBitmap&):
./include/wx/bmpbuttn.h:39: error: m_bmpNormal was not declared in this scope
./include/wx/bmpbuttn.h: In member function void wxBitmapButtonBase::SetBitmapSelected(const wxBitmap&):
./include/wx/bmpbuttn.h:41: error: m_bmpSelected was not declared in this scope
./include/wx/bmpbuttn.h: In member function void wxBitmapButtonBase::SetBitmapFocus(const wxBitmap&):
./include/wx/bmpbuttn.h:43: error: m_bmpFocus was not declared in this scope
./include/wx/bmpbuttn.h: In member function void wxBitmapButtonBase::SetBitmapDisabled(const wxBitmap&):
./include/wx/bmpbuttn.h:45: error: m_bmpDisabled was not declared in this scope
./include/wx/bmpbuttn.h: In member function const wxBitmap& wxBitmapButtonBase::GetBitmapLabel() const:
./include/wx/bmpbuttn.h:50: error: m_bmpNormal was not declared in this scope
./include/wx/bmpbuttn.h: In member function const wxBitmap& wxBitmapButtonBase::GetBitmapSelected() const:
./include/wx/bmpbuttn.h:51: error: m_bmpSelected was not declared in this scope
./include/wx/bmpbuttn.h: In member function const wxBitmap& wxBitmapButtonBase::GetBitmapFocus() const:
./include/wx/bmpbuttn.h:52: error: m_bmpFocus was not declared in this scope
./include/wx/bmpbuttn.h: In member function const wxBitmap& wxBitmapButtonBase::GetBitmapDisabled() const:
./include/wx/bmpbuttn.h:53: error: m_bmpDisabled was not declared in this scope
./include/wx/bmpbuttn.h: In member function wxBitmap& wxBitmapButtonBase::GetBitmapLabel():
./include/wx/bmpbuttn.h:54: error: m_bmpNormal was not declared in this scope
./include/wx/bmpbuttn.h: In member function wxBitmap& wxBitmapButtonBase::GetBitmapSelected():
./include/wx/bmpbuttn.h:55: error: m_bmpSelected was not declared in this scope
./include/wx/bmpbuttn.h: In member function wxBitmap& wxBitmapButtonBase::GetBitmapFocus():
./include/wx/bmpbuttn.h:56: error: m_bmpFocus was not declared in this scope
./include/wx/bmpbuttn.h: In member function wxBitmap& wxBitmapButtonBase::GetBitmapDisabled():
./include/wx/bmpbuttn.h:57: error: m_bmpDisabled was not declared in this scope
./include/wx/bmpbuttn.h: In member function virtual void wxBitmapButtonBase::OnSetBitmap():
./include/wx/bmpbuttn.h:66: error: InvalidateBestSize was not declared in this scope
./include/wx/bmpbuttn.h: In member function virtual void wxBitmapButtonBase::SetLabel(const wxString&):
./include/wx/bmpbuttn.h:81: error: cannot call member function virtual void wxWindowBase::SetLabel(const wxString&) without object
./include/wx/checkbox.h: In member function bool wxCheckBoxBase::Is3State() const:
./include/wx/checkbox.h:102: error: HasFlag was not declared in this scope
./include/wx/checkbox.h: In member function bool wxCheckBoxBase::Is3rdStateAllowedForUser() const:
./include/wx/checkbox.h:106: error: HasFlag was not declared in this scope
./include/wx/univ/checkbox.h: At global scope:
./include/wx/univ/checkbox.h:145: error: field m_bitmaps has incomplete type
./include/wx/univ/checkbox.h: In member function wxBitmap wxCheckBox::DoGetBitmap(wxCheckBox::State, wxCheckBox::Status) const:
./include/wx/univ/checkbox.h:135: error: return type struct wxBitmap is incomplete
./include/wx/univ/checkbox.h:135: error: m_bitmaps was not declared in this scope
./include/wx/listbox.h: In member function bool wxListBoxBase::HasMultipleSelection() const:
./include/wx/listbox.h:99: error: m_windowStyle was not declared in this scope
./include/wx/listbox.h: In member function bool wxListBoxBase::IsSorted() const:
./include/wx/listbox.h:104: error: m_windowStyle was not declared in this scope
./include/wx/scrolwin.h: In member function wxSize wxScrollHelper::GetTargetSize() const:
./include/wx/scrolwin.h:159: error: class wxWindow has no member named GetClientSize
./include/wx/univ/listbox.h: In member function bool wxListBox::HasHorzScrollbar() const:
./include/wx/univ/listbox.h:225: error: m_windowStyle was not declared in this scope
./include/wx/textctrl.h: At global scope:
./include/wx/textctrl.h:250: error: field m_colText has incomplete type
./include/wx/textctrl.h:251: error: field m_colBack has incomplete type
./include/wx/textctrl.h:252: error: field m_font has incomplete type
./include/wx/textctrl.h: In member function void wxTextAttr::SetTextColour(const wxColour&):
./include/wx/textctrl.h:205: error: m_colText was not declared in this scope
./include/wx/textctrl.h: In member function void wxTextAttr::SetBackgroundColour(const wxColour&):
./include/wx/textctrl.h:206: error: m_colBack was not declared in this scope
./include/wx/textctrl.h: In member function void wxTextAttr::SetFont(const wxFont&, long int):
./include/wx/textctrl.h:207: error: m_font was not declared in this scope
./include/wx/textctrl.h: In member function bool wxTextAttr::HasTextColour() const:
./include/wx/textctrl.h:215: error: m_colText was not declared in this scope
./include/wx/textctrl.h: In member function bool wxTextAttr::HasBackgroundColour() const:
./include/wx/textctrl.h:216: error: m_colBack was not declared in this scope
./include/wx/textctrl.h: In member function bool wxTextAttr::HasFont() const:
./include/wx/textctrl.h:217: error: m_font was not declared in this scope
./include/wx/textctrl.h: In member function const wxColour& wxTextAttr::GetTextColour() const:
./include/wx/textctrl.h:224: error: m_colText was not declared in this scope
./include/wx/textctrl.h: In member function const wxColour& wxTextAttr::GetBackgroundColour() const:
./include/wx/textctrl.h:225: error: m_colBack was not declared in this scope
./include/wx/textctrl.h: In member function const wxFont& wxTextAttr::GetFont() const:
./include/wx/textctrl.h:226: error: m_font was not declared in this scope
./include/wx/textctrl.h: In member function bool wxTextCtrlBase::IsSingleLine() const:
./include/wx/textctrl.h:296: error: HasFlag was not declared in this scope
./include/wx/textctrl.h: In member function void wxStreamToTextRedirector::Init(wxTextCtrl*):
./include/wx/textctrl.h:517: error: no matching function for call to std::basic_ostream<char, std::char_traits<char> >::rdbuf(wxTextCtrl*&)
/usr/include/c++/4.0.2/bits/basic_ios.h:307: note: candidates are: std::basic_streambuf<_CharT, _Traits>* std::basic_ios<_CharT, _Traits>::rdbuf() const [with _CharT = char, _Traits = std::char_traits<char>]
/usr/include/c++/4.0.2/bits/basic_ios.tcc:56: note:                 std::basic_streambuf<_CharT, _Traits>* std::basic_ios<_CharT, _Traits>::rdbuf(std::basic_streambuf<_CharT, _Traits>*) [with _CharT = char, _Traits = std::char_traits<char>]
./include/wx/univ/combobox.h: At global scope:
./include/wx/univ/combobox.h:70: warning: class wxComboPopup has virtual functions but non-virtual destructor
./include/wx/univ/combobox.h: In member function void wxComboBox::SetClientData(void*):
./include/wx/univ/combobox.h:307: error: SetClientData is not a member of wxControl
./include/wx/univ/combobox.h: In member function void* wxComboBox::GetClientData() const:
./include/wx/univ/combobox.h:307: error: GetClientData is not a member of wxControl
./include/wx/univ/combobox.h: In member function void wxComboBox::SetClientObject(wxClientData*):
./include/wx/univ/combobox.h:307: error: SetClientObject is not a member of wxControl
./include/wx/univ/combobox.h: In member function wxClientData* wxComboBox::GetClientObject() const:
./include/wx/univ/combobox.h:307: error: GetClientObject is not a member of wxControl
./include/wx/scrolbar.h: In member function bool wxScrollBarBase::IsVertical() const:
./include/wx/scrolbar.h:47: error: m_windowStyle was not declared in this scope
./include/wx/univ/scrarrow.h: At global scope:
./include/wx/univ/scrarrow.h:86: warning: class wxControlWithArrows has virtual functions but non-virtual destructor
./include/wx/univ/statbmp.h:72: error: field m_bitmap has incomplete type
./include/wx/univ/statbmp.h: In member function virtual wxBitmap wxStaticBitmap::GetBitmap() const:
./include/wx/univ/statbmp.h:62: error: return type struct wxBitmap is incomplete
./include/wx/univ/statbmp.h:62: error: m_bitmap was not declared in this scope
./include/wx/statbox.h: In member function virtual void wxStaticBoxBase::GetBordersForSizer(int*, int*) const:
./include/wx/statbox.h:45: error: GetCharHeight was not declared in this scope
./include/wx/slider.h: In member function virtual int wxSliderBase::ValueInvertOrNot(int) const:
./include/wx/slider.h:110: error: HasFlag was not declared in this scope
./include/wx/univ/scrthumb.h: At global scope:
./include/wx/univ/scrthumb.h:91: warning: class wxControlWithThumb has virtual functions but non-virtual destructor
./include/wx/univ/slider.h: In member function bool wxSlider::IsVert() const:
./include/wx/univ/slider.h:91: error: GetWindowStyle was not declared in this scope
./include/wx/univ/slider.h: In member function bool wxSlider::HasLabels() const:
./include/wx/univ/slider.h:99: error: GetWindowStyle was not declared in this scope
./include/wx/univ/slider.h: In member function bool wxSlider::HasTicks() const:
./include/wx/univ/slider.h:104: error: GetWindowStyle was not declared in this scope
./include/wx/gauge.h: In member function bool wxGaugeBase::IsVertical() const:
./include/wx/gauge.h:69: error: HasFlag was not declared in this scope
./include/wx/univ/gauge.h: In member function bool wxGauge::IsSmooth() const:
./include/wx/univ/gauge.h:55: error: GetWindowStyle was not declared in this scope
./include/wx/univ/gauge.h: In member function bool wxGauge::IsVertical() const:
./include/wx/univ/gauge.h:58: error: GetWindowStyle was not declared in this scope
./include/wx/tbarbase.h: At global scope:
./include/wx/tbarbase.h:230: error: field m_bmpNormal has incomplete type
./include/wx/tbarbase.h:231: error: field m_bmpDisabled has incomplete type
./include/wx/tbarbase.h: In constructor wxToolBarToolBase::wxToolBarToolBase(wxToolBarBase*, int, const wxString&, const wxBitmap&, const wxBitmap&, wxItemKind, wxObject*, const wxString&, const wxString&):
./include/wx/tbarbase.h:86: error: m_bmpNormal was not declared in this scope
./include/wx/tbarbase.h:87: error: m_bmpDisabled was not declared in this scope
./include/wx/tbarbase.h: In constructor wxToolBarToolBase::wxToolBarToolBase(wxToolBarBase*, wxControl*):
./include/wx/tbarbase.h:102: error: class wxControl has no member named GetId
./include/wx/tbarbase.h: In member function const wxBitmap& wxToolBarToolBase::GetNormalBitmap() const:
./include/wx/tbarbase.h:148: error: m_bmpNormal was not declared in this scope
./include/wx/tbarbase.h: In member function const wxBitmap& wxToolBarToolBase::GetDisabledBitmap() const:
./include/wx/tbarbase.h:149: error: m_bmpDisabled was not declared in this scope
./include/wx/tbarbase.h: In member function wxObject* wxToolBarToolBase::GetClientData() const:
./include/wx/tbarbase.h:163: error: class wxControl has no member named GetClientData
./include/wx/tbarbase.h: In member function void wxToolBarToolBase::SetNormalBitmap(const wxBitmap&):
./include/wx/tbarbase.h:180: error: m_bmpNormal was not declared in this scope
./include/wx/tbarbase.h: In member function void wxToolBarToolBase::SetDisabledBitmap(const wxBitmap&):
./include/wx/tbarbase.h:181: error: m_bmpDisabled was not declared in this scope
./include/wx/tbarbase.h: In member function void wxToolBarToolBase::SetClientData(wxObject*):
./include/wx/tbarbase.h:189: error: class wxControl has no member named SetClientData
./include/wx/tbarbase.h: In member function bool wxToolBarBase::IsVertical() const:
./include/wx/tbarbase.h:436: error: HasFlag was not declared in this scope
./include/wx/bookctrl.h: In member function virtual bool wxBookCtrlBase::RemovePage(size_t):
./include/wx/bookctrl.h:135: error: InvalidateBestSize was not declared in this scope
./include/wx/bookctrl.h: In member function virtual bool wxBookCtrlBase::DeleteAllPages():
./include/wx/bookctrl.h:142: error: InvalidateBestSize was not declared in this scope
./include/wx/bookctrl.h: In member function virtual bool wxBookCtrlBase::AddPage(wxWindow*, const wxString&, bool, int):
./include/wx/bookctrl.h:153: error: InvalidateBestSize was not declared in this scope
./include/wx/notebook.h: In member function virtual wxColour wxNotebookBase::GetThemeBackgroundColour() const:
./include/wx/notebook.h:95: error: return type struct wxColour is incomplete
./include/wx/univ/notebook.h: In member function bool wxNotebook::FixedSizeTabs() const:
./include/wx/univ/notebook.h:97: error: HasFlag was not declared in this scope
./include/wx/sizer.h: In member function void wxSizerItem::SetMinSize(const wxSize&):
./include/wx/sizer.h:200: error: class wxWindow has no member named SetMinSize
./include/wx/generic/choicdgg.h: In member function char* wxSingleChoiceDialog::GetSelectionClientData() const:
./include/wx/generic/choicdgg.h:141: error: m_clientData was not declared in this scope
./include/wx/valtext.h: In member function bool wxTextValidator::CheckValidator() const:
./include/wx/valtext.h:107: error: incomplete type wxTextCtrl used in nested name specifier
./include/wx/generic/textdlgg.h: In member function wxTextValidator* wxTextEntryDialog::GetTextValidator():
./include/wx/generic/textdlgg.h:55: error: invalid use of undefined type struct wxTextCtrl
./include/wx/log.h:76: error: forward declaration of struct wxTextCtrl
./include/wx/listbase.h: At global scope:
./include/wx/listbase.h:192: error: field m_colText has incomplete type
./include/wx/listbase.h:193: error: field m_colBack has incomplete type
./include/wx/listbase.h:194: error: field m_font has incomplete type
./include/wx/listbase.h: In constructor wxListItemAttr::wxListItemAttr(const wxColour&, const wxColour&, const wxFont&):
./include/wx/listbase.h:175: error: class wxListItemAttr does not have any field named m_colText
./include/wx/listbase.h:175: error: class wxListItemAttr does not have any field named m_colBack
./include/wx/listbase.h:175: error: class wxListItemAttr does not have any field named m_font
./include/wx/listbase.h: In member function void wxListItemAttr::SetTextColour(const wxColour&):
./include/wx/listbase.h:178: error: m_colText was not declared in this scope
./include/wx/listbase.h: In member function void wxListItemAttr::SetBackgroundColour(const wxColour&):
./include/wx/listbase.h:179: error: m_colBack was not declared in this scope
./include/wx/listbase.h: In member function void wxListItemAttr::SetFont(const wxFont&):
./include/wx/listbase.h:180: error: m_font was not declared in this scope
./include/wx/listbase.h: In member function bool wxListItemAttr::HasTextColour() const:
./include/wx/listbase.h:183: error: m_colText was not declared in this scope
./include/wx/listbase.h: In member function bool wxListItemAttr::HasBackgroundColour() const:
./include/wx/listbase.h:184: error: m_colBack was not declared in this scope
./include/wx/listbase.h: In member function bool wxListItemAttr::HasFont() const:
./include/wx/listbase.h:185: error: m_font was not declared in this scope
./include/wx/listbase.h: In member function const wxColour& wxListItemAttr::GetTextColour() const:
./include/wx/listbase.h:187: error: m_colText was not declared in this scope
./include/wx/listbase.h: In member function const wxColour& wxListItemAttr::GetBackgroundColour() const:
./include/wx/listbase.h:188: error: m_colBack was not declared in this scope
./include/wx/listbase.h: In member function const wxFont& wxListItemAttr::GetFont() const:
./include/wx/listbase.h:189: error: m_font was not declared in this scope
./include/wx/listbase.h: In member function wxColour wxListItem::GetTextColour() const:
./include/wx/listbase.h:277: error: return type struct wxColour is incomplete
./include/wx/listbase.h:277: error: operands to ?: have different types
./include/wx/listbase.h: In member function wxColour wxListItem::GetBackgroundColour() const:
./include/wx/listbase.h:279: error: return type struct wxColour is incomplete
./include/wx/listbase.h:280: error: operands to ?: have different types
./include/wx/listbase.h: In member function wxFont wxListItem::GetFont() const:
./include/wx/listbase.h:282: error: return type struct wxFont is incomplete
./include/wx/listbase.h:282: error: operands to ?: have different types
./include/wx/generic/listctrl.h: In member function bool wxGenericListCtrl::InReportView() const:
./include/wx/generic/listctrl.h:163: error: HasFlag was not declared in this scope
./include/wx/generic/listctrl.h: In member function bool wxGenericListCtrl::IsVirtual() const:
./include/wx/generic/listctrl.h:166: error: HasFlag was not declared in this scope
./include/wx/generic/listctrl.h: In member function bool wxGenericListCtrl::HasHeader() const:
./include/wx/generic/listctrl.h:170: error: HasFlag was not declared in this scope
./include/wx/generic/listctrl.h: In member function virtual wxVisualAttributes wxGenericListCtrl::GetDefaultAttributes() const:
./include/wx/generic/listctrl.h:182: error: GetWindowVariant was not declared in this scope
./include/wx/generic/listctrl.h: In member function virtual void wxGenericListCtrl::Update():
./include/wx/generic/listctrl.h:248: error: Update is not a member of wxWindow
./include/wx/generic/filedlgg.h: In member function virtual void wxGenericFileDialog::SetMessage(const wxString&):
./include/wx/generic/filedlgg.h:70: error: SetTitle was not declared in this scope
make: *** [.pch/wxprec_coredll/wx/wxprec.h.gch] Error 1
www:/home/mexus/wxPython-src-2.6.1.0 #          


                       
:  mexus

  • AOL  AOL:
  • ICQ  ICQ: 243745868
  • MSN  MSN: mexus_bg@hotmail.com
  • YIM  Yahoo IM:
WEB  
#2 Skip to the next post in this topic.
Skip to the previous post in this topic. : 29 2005, 09:15
mcwolf
 

No avatar chosen




: Li gurus
: 1489
: 2005

: 5

Offline
root - ( make install)

- configure - ( ) - textctrl.h - wxwin2.4-headers - - ( ) make
:  mcwolf

  • AOL  AOL:
  • ICQ  ICQ:
  • MSN  MSN:
  • YIM  Yahoo IM:
WEB  
#3 Skip to the next post in this topic.
Skip to the previous post in this topic. : 29 2005, 13:13
mexus
 

Avatar




: Li fans
: 163
: 2005

:

Offline
:  (mcwolf @ 29 2005,09:15)

root - ( make install)

- configure - ( ) - textctrl.h - wxwin2.4-headers - - ( ) make

, .

root .... ,   !
:  mexus

  • AOL  AOL:
  • ICQ  ICQ: 243745868
  • MSN  MSN: mexus_bg@hotmail.com
  • YIM  Yahoo IM:
WEB  
#4 Skip to the next post in this topic.
Skip to the previous post in this topic. : 29 2005, 13:19
mexus
 

Avatar




: Li fans
: 163
: 2005

:

Offline
wxwin2.4-headers - ?! ... :(
:  mexus

  • AOL  AOL:
  • ICQ  ICQ: 243745868
  • MSN  MSN: mexus_bg@hotmail.com
  • YIM  Yahoo IM:
WEB  
#5 Skip to the next post in this topic.
Skip to the previous post in this topic. : 29 2005, 16:26
quintessence
 

Avatar




: Li psychos
: 813
: 2005

Offline
:  quintessence

  • AOL  AOL:
  • ICQ  ICQ:
  • MSN  MSN:
  • YIM  Yahoo IM:
WEB  
#6
Skip to the previous post in this topic. : 29 2005, 23:35
mexus
 

Avatar




: Li fans
: 163
: 2005

:

Offline
:  (quintessence @ 29 2005,16:26)

, .....
:  mexus

  • AOL  AOL:
  • ICQ  ICQ: 243745868
  • MSN  MSN: mexus_bg@hotmail.com
  • YIM  Yahoo IM:
WEB  
< | >
5 () 28 2005, 23:01
  • 1 1 Skip to Page:
  • 1
 »  » Li Help & Support Applications : wxPython

© 2014 Linux Index Project
Powered by iF 1.0.0 © 2006 ikonForums